Gradle argument type mismatch

WebFeb 7, 2024 · For example, to pass the Variant argument MyVar to a procedure that expects an Integer argument, you can write the call as follows: Dim MyVar MyVar = 3.1415 Call SomeSub((MyVar)) Sub SomeSub (MyNum As Integer) MyNum = MyNum + MyNum End Sub Placing the argument in its own set of parentheses forces evaluation of it as an …

Guide to JUnit 5 Parameterized Tests Baeldung

WebMar 20, 2014 · This exception indicates that a method is called with incorrect input arguments. Then, the only thing you must do is correct the values of the input parameters. In order to achieve that, follow the call stack found in the stack trace and check which method produced the invalid argument. WebThe Gradle version used for downloading and executing the Wrapper. --distribution-type The Gradle distribution type used for the Wrapper. Available options are bin and all. The default value is bin. --gradle … can hemoglobin be recycled https://bear4homes.com

Argument type mismatch when attempting to invoke …

WebApr 24, 2024 · Gradle: Cannot call testImplementation (), receiver type mismatch Geosearchef April 24, 2024, 10:24am #1 I’m trying to add the io.mockk:mockk:1.12.3 dependency to my Kotlin Multiplatform project using Gradle Kotlin DSL. When using testImplementation ("io.mockk:mockk:1.12.3") I get: Unresolved reference. WebIt will list out all the available versions of the gradle. As per your need install and use. for e.g. sdk install gradle 4.8 (this will choose the 4.8 by default in current shell) sdk use gradle 4.8 (if already installed, this is suffice to switch between gradle version) And now the build.gradle was able to compile and execute the task. WebJSF convertNumber抛出java.lang.IllegalArgumentException:参数类型不匹配错误,java,jsf,Java,Jsf,我正在使用JSF1.2。我的IDE是RAD 在我的xhtml页面中,Iam使用convertNumber标记格式化整数变量。 fitflop women\u0027s clogs

(React Native): Execution failed for task

Category:JSF convertNumber抛出java.lang.IllegalArgumentException:参数类 …

Tags:Gradle argument type mismatch

Gradle argument type mismatch

Using apply(from...) partial files android · Issue #1287 · gradle ...

WebFeb 23, 2024 · Also, when using Gradle, we'll specify it a little differently: testCompile ( "org.junit.jupiter:junit-jupiter-params:5.9.2") Copy 3. First Impression Let's say we have an existing utility function, and we'd like to be confident about its behavior: public class Numbers { public static boolean isOdd(int number) { return number % 2 != 0 ; } } Copy WebSep 15, 2024 · Thanks for y’all’s suggestions! I reran it with @levlaz’s suggested edit and… well there’s not much more info there: #!/bin/bash --login if [ -a ./gradlew ]; then gradlew dependencies --stacktrace; else gradle dependencies --stacktrace; fi FAILURE: Build failed with an exception.

Gradle argument type mismatch

Did you know?

WebHere I am listing out some reasons for raising the illegal argument exception. When Arguments out of range. For example percentage should lie between 1 to 100. If user entered 200 then illegalarugmentexcpetion will be thrown. When arguments format is invalid. For example if our method requires date format like YYYY/MM/DD but if user is … WebJun 16, 2024 · argument type mismatch. Try: Run with --stacktrace option to get the stack trace. Run with --info or --debug option to get more log output. What went wrong: This …

WebJun 14, 2024 · An illegal argument exception is thrown when attempting to build RN Android apps using Gradle 7.0-rc-1 due to a type mismatch. This is down to a typo in … WebAug 13, 2024 · argument type mismatch. Try: Run with --info or --debug option to get more log output. Run with --scan to get full insights. Exception is: …

WebNov 3, 2024 · React Native app in Android studio: Cause Argument type mismatch. I cant build my app in react native. I started building with cleand project and sync gradle. … WebTroubleshooting daemon connection issues. If your Gradle build fails before running any tasks, you may be encountering problems with your network configuration. When Gradle is unable to communicate with the Gradle …

WebNov 26, 2024 · My release process fails with this weird “IllegalArgumentException: argument type mismatch” in a task that normally runs fine. My guess is that it fails because it is …

WebAug 24, 2024 · In the argument, specify the fully qualified nullability annotations package and one of these report levels: ignore to ignore nullability mismatches warn to report warnings strict to report errors. See the full list of supported nullability annotations along with their fully qualified package names. fitflop women\u0027s ginny glitz pool slide sandalWeb我在使用java和gradle版本3.4编译selenium自动化应用程序时遇到以下错误。 错误: method until in class FluentWait cannot be applied to given types; return getWebDriverWait().until(ExpectedConditions.elementToBeClickable(GOTO_ICON)); ^ required: Function found: ExpectedCondition … can hemoglobin carry carbon dioxideWeb主要介绍了Caused by: java.lang.ClassNotFoundException: org.objectweb.asm.Type异常,文中通过示例代码介绍的非常详细,对大家的学习或者工作具有一定的参考学习价值,需要的朋友们下面随着小编来一起学习学习吧 can hemolysis affect sodiumWebJun 15, 2024 · IllegalArgumentExceptionは不正な引数、または不適切な引数をメソッドに渡したことを示すためにスローされます。. illegalには「許容されない」、argumentには「引数」という意味があります。. 英語の意味が分かれば例外も何となくわかった気になりま … can hemoglobin function if it is unfoldedWebAlso note that the Plugin class is a generic type. This example has it receiving the Project type as a type parameter. A plugin can instead receive a parameter of type Settings, in which case the plugin can be applied in a settings script, or a parameter of type Gradle, in which case the plugin can be applied in an initialization script. can hemochromatosis lead to cancerWebJul 13, 2024 · In this quick tutorial, we’re going to see how to pass command-line arguments from Gradle. 2. Types of Input Arguments. When we want to pass input … fitflop women\u0027s iqushion sparkle flip flopWebMar 12, 2024 · Gradle: 6.2.2 Android-gradle-plugin: 3.6.1 OS: Mac OSX 10.15.3 The ex... I have an android project and I use composite builds to connect it to another android library dependency. This used to work, but broke sometime in the past few months. ... argument type mismatch at com.sun.jmx.mbeanserver.StandardMBeanIntrospector.invokeM2 ... can hemolysis cause hyponatremia